{"text_format":"1","workbook":"xlsx","n_sheets":15,"sheets":["Personal Expense Budget","0. Basic Info","1. Sales Forecast","2. Operating Budget","3. Startup Costs","4. Equipment & Vehicle Costs","5. Facility Costs","6. Seasonality","7. Funding Plan","8. P&L and Cashflow","9. Sales Summary Tables","10. Financial Summary Tables","11. Balance Sheet","12. Loan Detail","BP Checklist"],"not_rendered":{"charts":7,"images":0,"macros":1,"external_links":1,"defined_names":53,"comments":2,"pivot_tables":0},"unopened":[],"bounds":{"document_bytes":16777216,"sheet_cells":100000,"rows_first":2000,"rows_last":500,"rows_between":2000,"halvings":0,"cell_chars":16384,"cell_head_chars":4096},"cells_cut":0,"cells_raw":0,"read":"whole","date_system":"1900"}

{"sheet":"Personal Expense Budget","index":0,"n_rows":60,"n_cols":12,"rows_kept":60,"cut":false,"hidden":false,"merged":[[0,8,0,10],[2,9,2,11],[3,9,3,11],[2,1,2,3],[3,1,3,3],[2,4,2,6],[3,4,3,6]]}
["My Household Budget Needs",null,null,null,{"$f":"SUM(E6:E60)","v":444.17521367521363},{"$f":"SUM(F6:F60)","v":1791.2592592592591},{"$f":"SUM(G6:G60)","v":21495.111111111109},null,"Monthly Household Income",null,null,{"$f":"SUM(J6:J12)*52+SUM(K6:K12)*12+SUM(L6:L12)","v":0}]
[]
[null,"Enter expense estimate in ONE",null,null,"Enter expense estimate in ONE",null,null,null,null,"INCOME"]
[null,"column Weekly/Monthly/Annual",null,null,"column Weekly/Monthly/Annual",null,null,null,null,"Enter value in only one column!"]
["Dwelling:","Weekly","Monthly","Annual","Weekly","Monthly","Annual",null,"Source","Weekly","Monthly","Annual"]
["Rent Payment",null,525,null,{"$f":"B6+C6/4+D6/52","v":131.25},{"$f":"B6*4+C6+D6/12","v":525},{"$f":"B6*52+C6*12+D6","v":6300},null,"Wage Income"]
["House Payment",null,null,null,{"$f":"B7+C7/4+D7/52","v":0},{"$f":"B7*4+C7+D7/12","v":0},{"$f":"B7*52+C7*12+D7","v":0}]
["Property Tax",null,null,null,0,0,0]
{"$rows_left_out":53}
{"sheet":"0. Basic Info","index":1,"n_rows":41,"n_cols":5,"rows_kept":41,"cut":false,"hidden":false,"merged":[[10,3,10,4],[0,4,0,5]]}
["Basic Information Sheet",null,null,null,{"$f":"D11","v":"ACME 5 Year"}]
[]
["This sheet is for entering basic information about your company that is then used on other sheets in the workbook."]
[]
[null,"TIP: On this sheet and alll other worksheets, be sure to ONLY change values with BLUE font color."]
[null,"       Black and other font color cells are calculated automatically and should not be manually adjusted."]
[]
[]
{"$rows_left_out":34}
{"sheet":"1. Sales Forecast","index":2,"n_rows":75,"n_cols":7,"rows_kept":75,"cut":false,"hidden":false,"merged":[[64,2,64,6],[0,4,0,6],[16,3,16,6],[17,3,17,6],[18,3,18,6],[52,2,52,6]]}
["1. Product Pricing and Cost Assumptions",null,null,null,{"$f":"'0. Basic Info'!D11","v":"ACME 5 Year"}]
["List up to six types of customers or sales transactions you will offer, the 'typical' price for each and 'typical' cost you pay to produce them,"]
["buy or produce each type of product/service."]
[]
["Customer Type",null,"Price",null,"COGS","COGS"]
["Customer Type 1",null,30,null,0.21,{"$f":"E6*C6","v":6.3}]
["Customer Type 2",null,25,null,0.21,{"$f":"E7*C7","v":5.25}]
["Customer Type 3",null,15,null,0.21,3.15]
{"$rows_left_out":68}
{"sheet":"2. Operating Budget","index":3,"n_rows":44,"n_cols":31,"rows_kept":44,"cut":false,"hidden":false,"merged":[[0,12,0,14],[0,15,0,18],[2,6,2,11],[8,6,8,7],[9,1,9,3],[3,8,3,11],[3,1,3,3],[4,1,4,3]]}
[{"$f":"'0. Basic Info'!D11","v":"ACME 5 Year"},null,null,"OPERATING BUDGET ESTIMATES",null,null,null,null,null,null,null,{"$f":"'1. Sales Forecast'!E21","v":34500},"INSTRUCTIONS"]
[]
[null,"Owner Paid Hours",null,{"$f":"E3/4","v":34.172413793103445},{"$f":"C8/7.25","v":136.68965517241378},null,"Average Monthly Budget"]
[null,"Enter expense estimate in ONE",null,null,"Or as a",null,null,null,"Totals",null,null,null,"On this sheet, you can estimate your operating expenses like rent, utilities, marketing, cell phone and other recurring expenses."]
[null,"column Weekly/Monthly/Annual",null,null,"% of",null,null,null,{"$f":"SUM(I7:I44)","v":492.75576923076926},{"$f":"SUM(J7:J44)","v":2135.2750000000001},{"$f":"SUM(K7:K44)","v":25623.3},{"$f":"SUM(L7:L44)","v":0.74270434782608696},"IMPORTANT: This is for expenses that repeat! One-time startup expenses are estimated on Tab 3, Tab 4 and Tab 5.",null,null,null,null,null,null,null,null,null,null,null,null,null,{"$f":"SUM(AA7:AA44)","v":25623.3},{"$f":"SUM(AB7:AB44)","v":26320.800000000003},26890.800000000003,27528.15,28241.137500000001]
["EXPENSES","Weekly","Monthly","Annual","Sales",null,"Expense Category",null,"Weekly","Monthly","Annual","of sales",null,null,null,null,null,null,null,null,null,null,null,null,null,null,{"$f":"'8. P&L and Cashflow'!P2","v":2016},{"$f":"'8. P&L and Cashflow'!AC2","v":2017},{"$f":"'8. P&L and Cashflow'!AD2","v":2018},{"$f":"'8. P&L and Cashflow'!AE2","v":2019},{"$f":"'8. P&L and Cashflow'!AF2","v":2020}]
["Worker Wages",null,null,null,null,null,{"$f":"IF(A7=\"\",\"\",A7)","v":"Worker Wages"},null,{"$f":"K7/52","v":0},{"$f":"K7/12","v":0},{"$f":"C7*12+D7+B7*52+($E7*L$1)","v":0},{"$f":"K7/$L$1","v":0},null,"This sheet allows you to estimate your operating expenses in one of four ways.",null,null,null,null,null,null,null,null,null,null,null,{"$f":"G7","v":"Worker Wages"},{"$f":"K7","v":0},{"$f":"'8. P&L and Cashflow'!AC13","v":0},{"$f":"'8. P&L and Cashflow'!AD13","v":0},{"$f":"'8. P&L and Cashflow'!AE13","v":0},{"$f":"'8. P&L and Cashflow'!AF13","v":0}]
["Owner Pay",null,991,null,null,null,{"$f":"IF(A8=\"\",\"\",A8)","v":"Owner Pay"},{"$f":"IF(B8=\"\",\"\",B8)","v":""},{"$f":"K8/52","v":228.69230769230768},{"$f":"K8/12","v":991},{"$f":"C8*12+D8+B8*52+($E8*L$1)","v":11892},0.34469565217391307,null,null,null,null,null,null,null,null,null,null,null,null,null,"Owner Pay",11892,{"$f":"'8. P&L and Cashflow'!AC14","v":11892},{"$f":"'8. P&L and Cashflow'!AD14","v":11892},{"$f":"'8. P&L and Cashflow'!AE14","v":11892},{"$f":"'8. P&L and Cashflow'!AF14","v":11892}]
{"$rows_left_out":37}
{"sheet":"3. Startup Costs","index":4,"n_rows":63,"n_cols":7,"rows_kept":63,"cut":false,"hidden":false,"merged":[]}
[{"$f":"'0. Basic Info'!D11","v":"ACME 5 Year"},null,"Business Startup Costs",null,null,{"$f":"SUM(F4:F63)","v":760}]
[null,null,null,"Tax",0,{"$f":"E2*F1","v":0},"Owner"]
["Qty","Purpose","Have","Item",null,{"$f":"F1+F2","v":760},{"$f":"SUM(G4:G63)","v":460}]
[1,"Business","Y","Incorporation",250,{"$f":"A4*E4","v":250},{"$f":"IF(C4=\"y\",F4,0)","v":250}]
[1,"Business","Y","Legal review of wholesale contracts",150,150,150]
[1,"Business","Y","Misc office items",60,60,60]
[1,"Business",null,"CPA setup QuickBooks on PC",300,300,0]
[null,null,null,null,null,0,0]
{"$rows_left_out":56}
{"sheet":"4. Equipment & Vehicle Costs","index":5,"n_rows":85,"n_cols":7,"rows_kept":85,"cut":false,"hidden":false,"merged":[[1,6,2,6]]}
[{"$f":"'0. Basic Info'!D11","v":"ACME 5 Year"},null,null,"Equipment, Office Equipment and Supply Startup Expenses"]
[null,null,null,null,null,{"$f":"SUM(F5:F85)","v":1744},"Owner\n Purchased"]
[null,null,null,"Tax",0,{"$f":"E3*F2","v":0}]
["Qty","Use","Have","Item","Price Each",{"$f":"F2+F3","v":1744},{"$f":"SUM(G5:G85)","v":1150}]
[1,"Business","Y","Mac Laptop",1000,{"$f":"A5*E5","v":1000},{"$f":"IF(C5=\"y\",F5,0)","v":1000}]
[1,"Business","Y","Printer",150,{"$f":"A6*E6","v":150},{"$f":"IF(C6=\"y\",F6,0)","v":150}]
[1,"Business",null,"QuickBook Program Online Version 1 Year",{"$f":"49.5*12","v":594},594,0]
[null,null,null,null,null,0,0]
{"$rows_left_out":78}
{"sheet":"5. Facility Costs","index":6,"n_rows":65,"n_cols":7,"rows_kept":65,"cut":false,"hidden":false,"merged":[[1,6,2,6]]}
[{"$f":"'0. Basic Info'!D11","v":"ACME 5 Year"},null,"Costs to prepare facility for operations"]
[null,null,null,null,null,{"$f":"SUM(F5:F62)","v":700},"Owner\n Purchased"]
[null,null,null,"Tax",5.0999999999999997E-2,{"$f":"E3*F2","v":35.699999999999996}]
["Vendor","Have","Use","Description","Total",{"$f":"F2+F3","v":735.7},{"$f":"SUM(G5:G62)","v":0}]
["Electrician",null,"Office","3 new outlets & lights",700,{"$f":"E5","v":700},{"$f":"IF(B5=\"y\",F5,0)","v":0}]
[null,null,null,null,0,{"$f":"E6","v":0},{"$f":"IF(B6=\"y\",F6,0)","v":0}]
[null,null,null,null,0,0,0]
[null,null,null,null,0,0,0]
{"$rows_left_out":58}
{"sheet":"6. Seasonality","index":7,"n_rows":65,"n_cols":15,"rows_kept":65,"cut":false,"hidden":false,"merged":[[12,0,12,11]]}
[{"$f":"'0. Basic Info'!D11","v":"ACME 5 Year"},null,null,"Seasonality and Initial Startup Delay in Reaching Sales Goals"]
[]
[]
["1. Startup Phase - How long for sales to ramp up to expected normal levels?"]
["If your business is a startup or expanding, it usually takes months and possibly a year before your sales "]
["volume increases to the level expected in your business plan. This is a normal situation, and to help"]
["forecast how much extra cash you will need to survive those start-up months until things start picking up, this Rapid Business"]
["Plan financial template allows you to estimate the number of months needed to reach full sales revenues."]
{"$rows_left_out":58}
{"sheet":"7. Funding Plan","index":8,"n_rows":33,"n_cols":7,"rows_kept":33,"cut":false,"hidden":false,"merged":[[0,0,0,2],[24,0,24,1],[23,0,23,1]]}
[{"$f":"'0. Basic Info'!D11","v":"ACME 5 Year"}]
[]
["Funding Plan - Cash Requirements and Funding Strategy"]
[]
["Startup Expenses and Investment",null,"Total","Owner Paid","Needed"]
["Business Startup",null,{"$f":"'3. Startup Costs'!F3","v":760},{"$f":"'3. Startup Costs'!G3","v":460},{"$f":"C6-D6","v":300}]
["Equipment",null,{"$f":"'4. Equipment & Vehicle Costs'!F4","v":1744},{"$f":"'4. Equipment & Vehicle Costs'!G4","v":1150},{"$f":"C7-D7","v":594}]
["Facilities",null,{"$f":"'5. Facility Costs'!F4","v":735.7},0,0]
{"$rows_left_out":26}
{"sheet":"8. P&L and Cashflow","index":9,"n_rows":80,"n_cols":32,"rows_kept":80,"cut":false,"hidden":false,"merged":[[0,0,0,1],[65,0,70,0],[71,0,76,0]]}
[{"$f":"'0. Basic Info'!D11","v":"ACME 5 Year"}]
[null,"SNAPSHOT",{"$f":"C6","v":"Annual"},{"$f":"D6","v":"2016-01-01"},{"$f":"E6","v":"2016-02-01"},"2016-03-03","2016-04-03","2016-05-04","2016-06-04","2016-07-05","2016-08-05","2016-09-05","2016-10-06","2016-11-06","2016-12-07",2016,{"$f":"Q6","v":"2017-01-01"},{"$f":"R6","v":"2017-02-01"},"2017-03-01","2017-04-01","2017-05-01","2017-06-01","2017-07-01","2017-08-01","2017-09-01","2017-10-01","2017-11-01","2017-12-01",2017,2018,2019,2020]
[null,"Net Profit",{"$f":"C60","v":678.35287668761396},{"$f":"D60","v":-847.04287698412713},{"$f":"E60","v":140.53342209169625},127.65508653702545,135.47121774075842,136.51256775329784,137.55955841173852,138.6122202695791,139.67058404581627,140.73468062584143,141.80454106234171,142.88019657620637,143.96167855743781,678.35287668761396,{"$f":"Q60","v":354.69640406194719},{"$f":"R60","v":355.78963382895705},356.88878525720492,357.99389042235572,359.10498157381778,360.22209113568363,361.34525170767614,362.47449606610036,363.60985716479939,364.75136813611635,365.8990622918613,367.05297312428314,3969.1797012149314,6771.7989257317786,9747.2156047619119,12971.34507976191]
[null,"Ending Cash Balance",{"$f":"P4","v":10139.23690974085},{"$f":"D79","v":8058.8028117434178},{"$f":"E79","v":9219.0769039387687},10565.361656438014,10518.345518060456,10471.247657078633,10424.067630828438,10376.804994248001,10329.4592998647,10282.030097782103,10234.516935666838,10186.919358735393,10139.23690974085,10139.23690974085,{"$f":"Q79","v":10301.116514455412},{"$f":"R79","v":10462.910325169356},10624.617877165178,10786.238703208153,10947.772333532705,11109.218295828692,11270.576115227626,11431.845314288814,11593.025412985427,11754.115928690491,11915.116376162801,12076.026267532763,12076.026267532759,16274.549168618763,26319.954297190197,39589.488900761629]
[]
[null,"P&L Income Statement","Annual",{"$f":"DATE('0. Basic Info'!D16,'0. Basic Info'!D17,1)","v":"2016-01-01"},{"$f":"D6+31","v":"2016-02-01"},{"$f":"E6+31","v":"2016-03-03"},{"$f":"F6+31","v":"2016-04-03"},{"$f":"G6+31","v":"2016-05-04"},"2016-06-04","2016-07-05","2016-08-05","2016-09-05","2016-10-06","2016-11-06","2016-12-07",{"$f":"IF('0. Basic Info'!D17=1,'0. Basic Info'!D16,\"Year 1\")","v":2016},{"$f":"DATE('0. Basic Info'!$D$16+1,'0. Basic Info'!$D$17,1)","v":"2017-01-01"},{"$f":"DATE('0. Basic Info'!$D$16+1,'0. Basic Info'!$D$17+1,1)","v":"2017-02-01"},{"$f":"DATE('0. Basic Info'!$D$16+1,'0. Basic Info'!$D$17+2,1)","v":"2017-03-01"},{"$f":"DATE('0. Basic Info'!$D$16+1,'0. Basic Info'!$D$17+3,1)","v":"2017-04-01"},{"$f":"DATE('0. Basic Info'!$D$16+1,'0. Basic Info'!$D$17+4,1)","v":"2017-05-01"},{"$f":"DATE('0. Basic Info'!$D$16+1,'0. Basic Info'!$D$17+5,1)","v":"2017-06-01"},{"$f":"DATE('0. Basic Info'!$D$16+1,'0. Basic Info'!$D$17+6,1)","v":"2017-07-01"},{"$f":"DATE('0. Basic Info'!$D$16+1,'0. Basic Info'!$D$17+7,1)","v":"2017-08-01"},{"$f":"DATE('0. Basic Info'!$D$16+1,'0. Basic Info'!$D$17+8,1)","v":"2017-09-01"},{"$f":"DATE('0. Basic Info'!$D$16+1,'0. Basic Info'!$D$17+9,1)","v":"2017-10-01"},{"$f":"DATE('0. Basic Info'!$D$16+1,'0. Basic Info'!$D$17+10,1)","v":"2017-11-01"},{"$f":"DATE('0. Basic Info'!$D$16+1,'0. Basic Info'!$D$17+11,1)","v":"2017-12-01"},{"$f":"IF('0. Basic Info'!$D17=1,'0. Basic Info'!$D16+1,\"Year 2\")","v":2017},{"$f":"IF('0. Basic Info'!$D17=1,'0. Basic Info'!$D16+2,\"Year 3\")","v":2018},{"$f":"IF('0. Basic Info'!$D17=1,'0. Basic Info'!$D16+3,\"Year 4\")","v":2019},{"$f":"IF('0. Basic Info'!$D17=1,'0. Basic Info'!$D16+4,\"Year 5\")","v":2020}]
[null,"SALES",{"$f":"'6. Seasonality'!M48","v":34500},{"$f":"'6. Seasonality'!A48","v":1500},{"$f":"'6. Seasonality'!B48","v":3000},{"$f":"'6. Seasonality'!C48","v":3000},{"$f":"'6. Seasonality'!D48","v":3000},{"$f":"'6. Seasonality'!E48","v":3000},{"$f":"'6. Seasonality'!F48","v":3000},{"$f":"'6. Seasonality'!G48","v":3000},{"$f":"'6. Seasonality'!H48","v":3000},{"$f":"'6. Seasonality'!I48","v":3000},{"$f":"'6. Seasonality'!J48","v":3000},{"$f":"'6. Seasonality'!K48","v":3000},{"$f":"'6. Seasonality'!L48","v":3000},{"$f":"SUM(D7:O7)","v":34500},{"$f":"'6. Seasonality'!A54","v":3340},{"$f":"'6. Seasonality'!B54","v":3340},{"$f":"'6. Seasonality'!C54","v":3340},{"$f":"'6. Seasonality'!D54","v":3340},{"$f":"'6. Seasonality'!E54","v":3340},{"$f":"'6. Seasonality'!F54","v":3340},{"$f":"'6. Seasonality'!G54","v":3340},{"$f":"'6. Seasonality'!H54","v":3340},{"$f":"'6. Seasonality'!I54","v":3340},{"$f":"'6. Seasonality'!J54","v":3340},{"$f":"'6. Seasonality'!K54","v":3340},{"$f":"'6. Seasonality'!L54","v":3340},{"$f":"SUM(Q7:AB7)","v":40080},{"$f":"'1. Sales Forecast'!E62","v":44640.000000000007},{"$f":"'1. Sales Forecast'!F62","v":49738.80000000001},{"$f":"'1. Sales Forecast'!G62","v":55442.700000000004}]
[null,"COGS",{"$f":"'6. Seasonality'!M49","v":7245},{"$f":"'6. Seasonality'!A49","v":315},{"$f":"'6. Seasonality'!B49","v":630},{"$f":"'6. Seasonality'!C49","v":630},{"$f":"'6. Seasonality'!D49","v":630},{"$f":"'6. Seasonality'!E49","v":630},{"$f":"'6. Seasonality'!F49","v":630},{"$f":"'6. Seasonality'!G49","v":630},{"$f":"'6. Seasonality'!H49","v":630},{"$f":"'6. Seasonality'!I49","v":630},{"$f":"'6. Seasonality'!J49","v":630},{"$f":"'6. Seasonality'!K49","v":630},{"$f":"'6. Seasonality'!L49","v":630},{"$f":"SUM(D8:O8)","v":7245},{"$f":"'6. Seasonality'!A55","v":701.4},{"$f":"'6. Seasonality'!B55","v":701.4},{"$f":"'6. Seasonality'!C55","v":701.4},{"$f":"'6. Seasonality'!D55","v":701.4},{"$f":"'6. Seasonality'!E55","v":701.4},{"$f":"'6. Seasonality'!F55","v":701.4},{"$f":"'6. Seasonality'!G55","v":701.4},{"$f":"'6. Seasonality'!H55","v":701.4},{"$f":"'6. Seasonality'!I55","v":701.4},{"$f":"'6. Seasonality'!J55","v":701.4},{"$f":"'6. Seasonality'!K55","v":701.4},{"$f":"'6. Seasonality'!L55","v":701.4},{"$f":"SUM(Q8:AB8)","v":8416.7999999999975},{"$f":"'1. Sales Forecast'!E74","v":9374.4000000000015},{"$f":"'1. Sales Forecast'!F74","v":10445.148000000001},{"$f":"'1. Sales Forecast'!G74","v":11642.967000000001}]
{"$rows_left_out":73}
{"sheet":"9. Sales Summary Tables","index":10,"n_rows":0,"n_cols":0,"rows_kept":0,"cut":false,"hidden":false,"merged":[]}

{"sheet":"10. Financial Summary Tables","index":11,"n_rows":42,"n_cols":3,"rows_kept":42,"cut":false,"hidden":false,"merged":[]}
[]
[]
[]
[]
[]
[]
[]
[]
{"$rows_left_out":35}
{"sheet":"11. Balance Sheet","index":12,"n_rows":38,"n_cols":32,"rows_kept":38,"cut":false,"hidden":false,"merged":[]}
[{"$f":"'0. Basic Info'!D11","v":"ACME 5 Year"},null,"Pro Forma Balance Sheet"]
[]
[]
[null,null,null,{"$f":"DAY(DATE(YEAR(D8),MONTH(D8)+1,1)-1)","v":31},29,31,30,31,30,31,31,30,31,30,31,{"$f":"DAY(DATE(YEAR(P6),MONTH(P6)+1,1)-1)","v":31},{"$f":"DAY(DATE(YEAR(Q8),MONTH(Q8)+1,1)-1)","v":31},28,31,30,31,30,31,31,30,31,30,31,31,31,31,31]
[]
[]
[]
[null,"ASSETS","Starting Balance",{"$f":"DATEVALUE('0. Basic Info'!D17&\"/1/\"&'0. Basic Info'!D16)","v":"2016-01-01"},{"$f":"D8+D4","v":"2016-02-01"},"2016-03-01","2016-04-01","2016-05-01","2016-06-01","2016-07-01","2016-08-01","2016-09-01","2016-10-01","2016-11-01","2016-12-01",{"$f":"IF('0. Basic Info'!$D$17=1,'0. Basic Info'!$D$16,\"Year 1\")","v":2016},{"$f":"O8+O4","v":"2017-01-01"},{"$f":"Q8+Q4","v":"2017-02-01"},"2017-03-01","2017-04-01","2017-05-01","2017-06-01","2017-07-01","2017-08-01","2017-09-01","2017-10-01","2017-11-01","2017-12-01",{"$f":"IF('0. Basic Info'!$D$17=1,'0. Basic Info'!$D$16+1,\"Year 2\")","v":2017},{"$f":"IF('0. Basic Info'!$D$17=1,'0. Basic Info'!$D$16+2,\"Year 3\")","v":2018},{"$f":"IF('0. Basic Info'!$D$17=1,'0. Basic Info'!$D$16+3,\"Year 4\")","v":2019},{"$f":"IF('0. Basic Info'!$D$17=1,'0. Basic Info'!$D$16+4,\"Year 5\")","v":2020}]
{"$rows_left_out":31}
{"sheet":"12. Loan Detail","index":13,"n_rows":31,"n_cols":68,"rows_kept":31,"cut":false,"hidden":false,"merged":[[1,0,1,2]]}
["Loan Ammortization"]
[{"$f":"'0. Basic Info'!D11","v":"ACME 5 Year"},null,null,1,2,3,4,5,6,7,8,9,10,11,12,null,13,14,15,16,17,18,19,20,21,22,23,24,null,25,26,27,28,29,30,31,32,33,34,35,36,null,37,38,39,40,41,42,43,44,45,46,47,48,null,49,50,51,52,53,54,55,56,57,58,59,60]
[{"$f":"'7. Funding Plan'!A22","v":"Term Loan 1"},null,null,{"$f":"DATE('0. Basic Info'!D16,'0. Basic Info'!D17,1)","v":"2016-01-01"},{"$f":"D3+31","v":"2016-02-01"},{"$f":"E3+31","v":"2016-03-03"},{"$f":"F3+31","v":"2016-04-03"},{"$f":"G3+31","v":"2016-05-04"},"2016-06-04","2016-07-05","2016-08-05","2016-09-05","2016-10-06","2016-11-06","2016-12-07",{"$f":"IF('0. Basic Info'!$D17=1,'0. Basic Info'!$D16,\"Year 1\")","v":2016},{"$f":"D3","v":"2016-01-01"},{"$f":"Q3+31","v":"2016-02-01"},{"$f":"R3+31","v":"2016-03-03"},{"$f":"S3+31","v":"2016-04-03"},{"$f":"T3+31","v":"2016-05-04"},"2016-06-04","2016-07-05","2016-08-05","2016-09-05","2016-10-06","2016-11-06","2016-12-07",{"$f":"IF('0. Basic Info'!$D17=1,'0. Basic Info'!$D16+1,\"Year 2\")","v":2017},{"$f":"Q3","v":"2016-01-01"},{"$f":"AD3+31","v":"2016-02-01"},{"$f":"AE3+31","v":"2016-03-03"},{"$f":"AF3+31","v":"2016-04-03"},{"$f":"AG3+31","v":"2016-05-04"},"2016-06-04","2016-07-05","2016-08-05","2016-09-05","2016-10-06","2016-11-06","2016-12-07",{"$f":"IF('0. Basic Info'!$D17=1,'0. Basic Info'!$D16+2,\"Year 3\")","v":2018},{"$f":"AD3","v":"2016-01-01"},{"$f":"AQ3+31","v":"2016-02-01"},{"$f":"AR3+31","v":"2016-03-03"},{"$f":"AS3+31","v":"2016-04-03"},{"$f":"AT3+31","v":"2016-05-04"},"2016-06-04","2016-07-05","2016-08-05","2016-09-05","2016-10-06","2016-11-06","2016-12-07",{"$f":"IF('0. Basic Info'!$D17=1,'0. Basic Info'!$D16+3,\"Year 4\")","v":2019},{"$f":"AQ3","v":"2016-01-01"},{"$f":"BD3+31","v":"2016-02-01"},{"$f":"BE3+31","v":"2016-03-03"},{"$f":"BF3+31","v":"2016-04-03"},{"$f":"BG3+31","v":"2016-05-04"},"2016-06-04","2016-07-05","2016-08-05","2016-09-05","2016-10-06","2016-11-06","2016-12-07",{"$f":"IF('0. Basic Info'!$D17=1,'0. Basic Info'!$D16+4,\"Year 5\")","v":2020}]
[{"$f":"'7. Funding Plan'!C22","v":8085},"Amount","Balance",{"$f":"A4","v":8085},{"$f":"D8","v":7880.9965617434182},{"$f":"E8","v":7675.8881048629464},7469.6686438410388,7262.332160738596,7053.8726050193482,6844.2838933732883,6633.5599095391453,6421.6945041259005,6208.6814944333346,5994.5146642715999,5779.1877637798225,{"$f":"D4","v":8085},{"$f":"O8","v":5562.6945092437145},{"$f":"Q8","v":5345.0285829122031},{"$f":"R8","v":5126.183632813063},4906.1532725675524,4684.9310812040449,4462.5106029706521,4238.8853471468283,4014.0487878539589,3787.9943638649197,3560.7154784126064,3332.2054989974263,3102.4577571937475,{"$f":"Q4","v":5562.6945092437145},{"$f":"IF(AB8<0.1,0,AB8)","v":2871.4655484552986},{"$f":"AD8","v":2639.2221319195164},{"$f":"AE8","v":2405.7207302108322},2170.9545292428925,1934.9166780197099,1697.6002884357351,1458.9984350748471,1219.1041550082541,977.91044759130057,735.41027425917184,491.59655832149406,246.46218475582054,{"$f":"AO4","v":246.46218475582054},{"$f":"IF(AO8<0.1,0,AO8)","v":0},{"$f":"AQ8","v":0},{"$f":"AR8","v":0},0,0,0,0,0,0,0,0,0,{"$f":"BB4","v":0},{"$f":"IF(BB8<0.1,0,BB8)","v":0},{"$f":"BD8","v":0},{"$f":"BE8","v":0},0,0,0,0,0,0,0,0,0,{"$f":"BO4","v":0}]
[{"$f":"'7. Funding Plan'!D22","v":6.5000000000000002E-2},"Interest","Payment",{"$f":"IF(D4>0,PMT($A5/12,$A6*12,$A4)*-1,0)","v":247.79718825658162},{"$f":"IF(E4>0,PMT($A5/12,$A6*12,$A4)*-1,0)","v":247.79718825658162},247.79718825658162,247.79718825658162,247.79718825658162,247.79718825658162,247.79718825658162,247.79718825658162,247.79718825658162,247.79718825658162,247.79718825658162,247.79718825658162,{"$f":"SUM(D5:O5)","v":2973.5662590789793},247.79718825658162,247.79718825658162,247.79718825658162,247.79718825658162,247.79718825658162,247.79718825658162,247.79718825658162,247.79718825658162,247.79718825658162,247.79718825658162,247.79718825658162,247.79718825658162,{"$f":"SUM(Q5:AB5)","v":2973.5662590789793},247.79718825658162,247.79718825658162,247.79718825658162,247.79718825658162,247.79718825658162,247.79718825658162,247.79718825658162,247.79718825658162,247.79718825658162,247.79718825658162,247.79718825658162,247.79718825658162,{"$f":"SUM(AD5:AO5)","v":2973.5662590789793},0,0,0,0,0,0,0,0,0,0,0,0,{"$f":"SUM(AQ5:BB5)","v":0},0,0,0,0,0,0,0,0,0,0,0,0,{"$f":"SUM(BD5:BO5)","v":0}]
[{"$f":"'7. Funding Plan'!E22","v":3},"Term","Interest",{"$f":"$A5/12*D4","v":43.793750000000003},{"$f":"$A5/12*E4","v":42.688731376110184},{"$f":"$A5/12*F4","v":41.577727234674292},40.460705154138964,39.337632537334066,38.208476610521473,37.073204422438643,35.931782843337039,34.784178564015292,33.630358094847232,32.470287764804503,31.303933720474038,{"$f":"SUM(D6:O6)","v":451.2607683226957},{"$f":"$A5/12*Q4","v":30.13126192507012},28.952238157441101,27.766828011070761,26.574996893074243,25.376710023188576,24.1719324327577,22.960628963711986,21.742764267542277,20.518302804268316,19.287208841401618,18.049446452902725,16.8049795181328,{"$f":"SUM(Q6:AB6)","v":282.33729829056227},{"$f":"$A5/12*AD4","v":15.553771720799535},14.29578654789738,13.030987288642008,11.759337033399001,10.480798672606763,9.1953348956935663,7.9029081899887554,6.6034808396280429,5.2970149244528786,3.9834723189038477,2.662814690908093,1.3350035007606946,{"$f":"SUM(AD6:AO6)","v":102.10071062368057},{"$f":"$A5/12*AQ4","v":0},0,0,0,0,0,0,0,0,0,0,0,{"$f":"SUM(AQ6:BB6)","v":0},{"$f":"$A5/12*BD4","v":0},0,0,0,0,0,0,0,0,0,0,0,{"$f":"SUM(BD6:BO6)","v":0}]
[null,null,"Principal",{"$f":"D5-D6","v":204.0034382565816},{"$f":"E5-E6","v":205.10845688047144},{"$f":"F5-F6","v":206.21946102190734},207.33648310244266,208.45955571924756,209.58871164606015,210.72398383414298,211.86540541324459,213.01300969256633,214.1668301617344,215.32690049177711,216.49325453610757,{"$f":"SUM(D7:O7)","v":2522.3054907562837},{"$f":"Q5-Q6","v":217.66592633151151},218.84495009914053,220.03036024551085,221.22219136350736,222.42047823339306,223.62525582382392,224.83655929286962,226.05442398903935,227.27888545231332,228.50997941518,229.74774180367891,230.99220873844882,{"$f":"SUM(Q7:AB7)","v":2691.2289607884172},{"$f":"AD5-AD6","v":232.24341653578207},233.50140170868423,234.76620096793962,236.03785122318263,237.31638958397485,238.60185336088804,239.89428006659287,241.19370741695357,242.50017333212875,243.81371593767778,245.13437356567351,246.46218475582091,{"$f":"SUM(AD7:AO7)","v":2871.4655484552995},{"$f":"AQ5-AQ6","v":0},0,0,0,0,0,0,0,0,0,0,0,{"$f":"SUM(AQ7:BB7)","v":0},{"$f":"BD5-BD6","v":0},0,0,0,0,0,0,0,0,0,0,0,{"$f":"SUM(BD7:BO7)","v":0}]
[null,null,"Ending",{"$f":"IF(D4-D7<0,0,D4-D7)","v":7880.9965617434182},{"$f":"IF(E4-E7<0,0,E4-E7)","v":7675.8881048629464},7469.6686438410388,7262.332160738596,7053.8726050193482,6844.2838933732883,6633.5599095391453,6421.6945041259005,6208.6814944333346,5994.5146642715999,5779.1877637798225,5562.6945092437145,{"$f":"O8","v":5562.6945092437145},5345.0285829122031,5126.183632813063,4906.1532725675524,4684.9310812040449,4462.5106029706521,4238.8853471468283,4014.0487878539589,3787.9943638649197,3560.7154784126064,3332.2054989974263,3102.4577571937475,2871.4655484552986,{"$f":"AB8","v":2871.4655484552986},2639.2221319195164,2405.7207302108322,2170.9545292428925,1934.9166780197099,1697.6002884357351,1458.9984350748471,1219.1041550082541,977.91044759130057,735.41027425917184,491.59655832149406,246.46218475582054,0,{"$f":"AO8","v":0},0,0,0,0,0,0,0,0,0,0,0,0,{"$f":"BB8","v":0},0,0,0,0,0,0,0,0,0,0,0,0,{"$f":"BO8","v":0}]
{"$rows_left_out":24}
{"sheet":"BP Checklist","index":14,"n_rows":3,"n_cols":8,"rows_kept":3,"cut":false,"hidden":true,"merged":[]}
["Section","num","Description","question","answer 1","answer 2","answer 3","action"]
[2,1,"Name of Business","checked if available"]
[null,2,"Type"]