{"text_format":"1","workbook":"xlsx","n_sheets":15,"sheets":["Personal Expense Budget","0. Basic Info","1. Sales Forecast","2. Operating Budget","3. Startup Costs","4. Equipment & Vehicle Costs","5. Facility Costs","6. Seasonality","7. Funding Plan","8. P&L and Cashflow","9. Sales Summary Tables","10. Financial Summary Tables","11. Balance Sheet","12. Loan Detail","BP Checklist"],"not_rendered":{"charts":7,"images":0,"macros":1,"external_links":1,"defined_names":53,"comments":2,"pivot_tables":0},"unopened":[],"bounds":{"document_bytes":16777216,"sheet_cells":100000,"rows_first":2000,"rows_last":500,"rows_between":2000,"halvings":0,"cell_chars":16384,"cell_head_chars":4096},"cells_cut":0,"cells_raw":0,"read":"whole","date_system":"1900"}

{"sheet":"Personal Expense Budget","index":0,"n_rows":60,"n_cols":12,"rows_kept":60,"cut":false,"hidden":false,"merged":[[0,8,0,10],[2,9,2,11],[3,9,3,11],[2,1,2,3],[3,1,3,3],[2,4,2,6],[3,4,3,6]]}
["My Household Budget Needs",null,null,null,"Weekly","Monthly","Annual",null,"Household Income",null,null,{"$f":"SUM(J6:J12)*52+SUM(K6:K12)*12+SUM(L6:L12)","v":30000}]
[null,null,null,"TOTALS",{"$f":"SUM(E6:E60)","v":444.17521367521363},{"$f":"SUM(F6:F60)","v":1791.2592592592591},{"$f":"SUM(G6:G60)","v":21495.111111111109}]
[null,"Enter expense estimate in ONE",null,null,"Enter expense estimate in ONE",null,null,null,null,"INCOME"]
[null,"column Weekly/Monthly/Annual",null,null,"column Weekly/Monthly/Annual",null,null,null,null,"Enter value in only one column!"]
["Dwelling:","Weekly","Monthly","Annual","Weekly","Monthly","Annual",null,"Source","Weekly","Monthly","Annual"]
["Rent Payment",null,525,null,{"$f":"B6+C6/4+D6/52","v":131.25},{"$f":"B6*4+C6+D6/12","v":525},{"$f":"B6*52+C6*12+D6","v":6300},null,"Wage Income",null,1500]
{"$rows_left_out":55}
{"sheet":"0. Basic Info","index":1,"n_rows":41,"n_cols":5,"rows_kept":41,"cut":false,"hidden":false,"merged":[[10,3,10,4],[0,4,0,5]]}
["Basic Information Sheet",null,null,null,{"$f":"D11","v":"My Business"}]
[]
["This sheet is for entering basic information about your company that is then used on other sheets in the workbook."]
[]
[null,"TIP: On this sheet and alll other worksheets, be sure to ONLY change values with BLUE font color."]
[null,"       Black and other font color cells are calculated automatically and should not be manually adjusted."]
{"$rows_left_out":36}
{"sheet":"1. Sales Forecast","index":2,"n_rows":75,"n_cols":7,"rows_kept":75,"cut":false,"hidden":false,"merged":[[64,2,64,6],[0,4,0,6],[16,3,16,6],[17,3,17,6],[18,3,18,6],[52,2,52,6],[15,3,15,6]]}
["1. Product Pricing and Cost Assumptions",null,null,null,{"$f":"'0. Basic Info'!D11","v":"My Business"}]
["List up to six types of customers or sales transactions you have; the 'typical' price for each; and 'typical' cost"]
["for you to produce/deliver the product or services sold (i.e. Cost of Goods Sold COGS)"]
[]
["Customer Type",null,null,null,"Sales Revenue","COGS","COGS"]
["Customer 1",null,null,null,30,0.21,{"$f":"F6*E6","v":6.3}]
{"$rows_left_out":70}
{"sheet":"2. Operating Budget","index":3,"n_rows":44,"n_cols":31,"rows_kept":44,"cut":false,"hidden":false,"merged":[[0,12,0,14],[0,15,0,18],[2,6,2,11],[8,6,8,7],[9,1,9,3],[3,8,3,11],[3,1,3,3],[4,1,4,3],[3,26,3,30]]}
[{"$f":"'0. Basic Info'!D11","v":"My Business"},null,null,"OPERATING BUDGET ESTIMATES",null,null,null,null,null,null,null,{"$f":"'1. Sales Forecast'!E21","v":256450},"INSTRUCTIONS",null,null,null,null,null,null,null,null,null,null,null,null,"Employee Estimate",15,"Average Hourly Wage"]
[null,null,null,null,null,null,null,null,null,null,null,null,null,null,null,null,null,null,null,null,null,null,null,null,null,"Full-time-Equivalent (FTE)",{"$f":"K7/AA1/2080","v":2.0548878205128207},"FTE Employees"]
[null,null,null,null,null,null,"First Year Average Monthly Budget"]
[null,"Enter expense estimate in ONE",null,null,"Or as a",null,null,null,"Totals",null,null,null,"On this sheet, you can estimate your operating expenses like rent, utilities, marketing, cell phone and other recurring expenses.",null,null,null,null,null,null,null,null,null,null,null,null,null,"Expenses as Percentage of Sales"]
[null,"column Weekly/Monthly/Annual",null,null,"% of",null,null,null,{"$f":"SUM(I7:I44)","v":3789.6246875000002},{"$f":"SUM(J7:J44)","v":16421.706979166662},{"$f":"SUM(K7:K44)","v":197060.48375000001},{"$f":"SUM(L7:L44)","v":0.76841678202378638},"IMPORTANT: This is for expenses that repeat! One-time startup expenses are estimated on Tab 3, Tab 4 and Tab 5.",null,null,null,null,null,null,null,null,null,null,null,null,"Gross Sales",{"$f":"'8. P&L and Cashflow'!P7","v":256450},{"$f":"'8. P&L and Cashflow'!AC7","v":303060},{"$f":"'8. P&L and Cashflow'!AD7","v":343371},{"$f":"'8. P&L and Cashflow'!AE7","v":389213.85},{"$f":"'8. P&L and Cashflow'!AF7","v":441366.84749999997}]
["EXPENSES","Weekly","Monthly","Annual","Sales",null,"Expense Category",null,"Weekly","Monthly","Annual","of sales",null,null,null,null,null,null,null,null,null,null,null,null,null,null,{"$f":"'8. P&L and Cashflow'!P2","v":2019},{"$f":"'8. P&L and Cashflow'!AC2","v":2020},{"$f":"'8. P&L and Cashflow'!AD2","v":2021},{"$f":"'8. P&L and Cashflow'!AE2","v":2022},{"$f":"'8. P&L and Cashflow'!AF2","v":2023}]
{"$rows_left_out":39}
{"sheet":"3. Startup Costs","index":4,"n_rows":63,"n_cols":7,"rows_kept":63,"cut":false,"hidden":false,"merged":[]}
[{"$f":"'0. Basic Info'!D11","v":"My Business"},null,"Business Startup Costs",null,null,{"$f":"SUM(F4:F63)","v":3350}]
[null,null,null,"Tax",0,{"$f":"E2*F1","v":0},"Owner"]
["Qty","Purpose","Have","Item",null,{"$f":"F1+F2","v":3350},{"$f":"SUM(G4:G63)","v":350}]
[null,null,null,"List non-asset startup items here",null,{"$f":"A4*E4","v":0},{"$f":"IF(C4=\"y\",F4,0)","v":0}]
[null,null,null,"Ex: Website, LLC costs, office supply",null,0,0]
[null,null,null,"      marketing materials, deposits,",null,0,0]
{"$rows_left_out":58}
{"sheet":"4. Equipment & Vehicle Costs","index":5,"n_rows":85,"n_cols":7,"rows_kept":85,"cut":false,"hidden":false,"merged":[[1,6,2,6]]}
[{"$f":"'0. Basic Info'!D11","v":"My Business"},null,null,"Equipment, Office Equipment and Supply Startup Expenses"]
[null,null,null,null,null,{"$f":"SUM(F5:F85)","v":6785},"Owner\n Purchased"]
[null,null,null,"Tax",0,{"$f":"E3*F2","v":0}]
["Qty","Use","Have","Item","Price Each",{"$f":"F2+F3","v":6785},{"$f":"SUM(G5:G85)","v":4785}]
[null,null,null,"List assets like PCs, printers, vehicles",null,{"$f":"A5*E5","v":0},{"$f":"IF(C5=\"y\",F5,0)","v":0}]
[null,null,null,"furnishings, buildings, equipment",null,{"$f":"A6*E6","v":0},{"$f":"IF(C6=\"y\",F6,0)","v":0}]
{"$rows_left_out":80}
{"sheet":"5. Facility Costs","index":6,"n_rows":65,"n_cols":7,"rows_kept":65,"cut":false,"hidden":false,"merged":[[1,6,2,6]]}
[{"$f":"'0. Basic Info'!D11","v":"My Business"},null,"Costs to prepare facility for operations"]
[null,null,null,null,null,{"$f":"SUM(F5:F62)","v":6000},"Owner\n Purchased"]
[null,null,null,"Tax",5.0999999999999997E-2,{"$f":"E3*F2","v":306}]
["Vendor","Have","Use","Description","Total",{"$f":"F2+F3","v":6306},{"$f":"SUM(G5:G62)","v":0}]
[null,null,null,"If need to buy building, or improve a space",null,{"$f":"E5","v":0},{"$f":"IF(B5=\"y\",F5,0)","v":0}]
[null,null,null,"List costs here",0,{"$f":"E6","v":0},{"$f":"IF(B6=\"y\",F6,0)","v":0}]
{"$rows_left_out":60}
{"sheet":"6. Seasonality","index":7,"n_rows":65,"n_cols":15,"rows_kept":65,"cut":false,"hidden":false,"merged":[[12,0,12,11]]}
[{"$f":"'0. Basic Info'!D11","v":"My Business"},null,null,"Seasonality and Initial Startup Delay in Reaching Sales Goals"]
[]
[]
["1. Startup Phase - How long for sales to ramp up to expected normal levels?"]
["If your business is a startup or expanding, it usually takes months and possibly a year before your sales "]
["volume increases to the level expected in your business plan. This is a normal situation, and to help"]
{"$rows_left_out":60}
{"sheet":"7. Funding Plan","index":8,"n_rows":33,"n_cols":7,"rows_kept":33,"cut":false,"hidden":false,"merged":[[0,0,0,2],[24,0,24,1],[23,0,23,1],[25,4,25,6]]}
[{"$f":"'0. Basic Info'!D11","v":"My Business"}]
[]
["Funding Plan - Cash Requirements and Funding Strategy"]
[]
["Startup Expenses and Investment",null,"Total","Owner Paid","Needed"]
["Business Startup",null,{"$f":"'3. Startup Costs'!F3","v":3350},{"$f":"'3. Startup Costs'!G3","v":350},{"$f":"C6-D6","v":3000}]
{"$rows_left_out":28}
{"sheet":"8. P&L and Cashflow","index":9,"n_rows":80,"n_cols":32,"rows_kept":80,"cut":false,"hidden":false,"merged":[[0,0,0,1],[65,0,70,0],[71,0,76,0]]}
[{"$f":"'0. Basic Info'!D11","v":"My Business"}]
[null,"SNAPSHOT",{"$f":"C6","v":"Annual"},{"$f":"D6","v":"2019-01-01"},{"$f":"E6","v":"2019-02-01"},"2019-03-04","2019-04-04","2019-05-05","2019-06-05","2019-07-06","2019-08-06","2019-09-06","2019-10-07","2019-11-07","2019-12-08",2019,{"$f":"Q6","v":"2020-01-01"},{"$f":"R6","v":"2020-02-01"},"2020-03-01","2020-04-01","2020-05-01","2020-06-01","2020-07-01","2020-08-01","2020-09-01","2020-10-01","2020-11-01","2020-12-01",2020,2021,2022,2023]
[null,"Net Profit",{"$f":"C60","v":2190.4476053960566},{"$f":"D60","v":-2996.0662053571414},{"$f":"E60","v":457.23315365746316},460.04159719836485,462.86493969469819,465.70326054310902,468.55663956486643,471.42515700814033,474.30889355029086,477.20793030017057,480.1223488004386,483.05223102988708,485.99765940578106,2190.4476053960566,{"$f":"Q60","v":1320.9644732972586},{"$f":"R60","v":1323.9412429834999},1326.9338087223982,1329.9422547087529,1332.9666655877229,1336.0071264572412,1339.0637228704438,1342.1365408381118,1345.2256668311256,1348.331187782934,1351.4531910920346,1354.5917646244686,14660.694789915646,26773.37475072583,38907.890388825886,52465.170451704442]
[null,"Ending Cash Balance",{"$f":"P4","v":73049.919799345953},{"$f":"D79","v":73050.695364730724},{"$f":"E79","v":73051.688256850946},73052.47183637631,73053.044992891402,73053.406610063394,73053.555565610382,73053.490731269601,73053.210972765417,73052.71514977717,73052.002115906842,73051.070718646573,73049.919799345953,73049.919799345953,{"$f":"Q79","v":73880.553949690235},{"$f":"R79","v":74710.966242134149},75541.155499401837,76371.120537942421,77200.860167896462,78030.373193062158,78859.658410861492,79688.714612306052,80517.540581962792,81346.135097919527,82174.496931750298,83002.624848480496,83002.62484848054,103188.76695894473,142567.91568341534,196344.47383603681]
[null,{"$f":"A1","v":"My Business"}]
[null,"P&L Income Statement","Annual",{"$f":"DATE('0. Basic Info'!D16,'0. Basic Info'!D17,1)","v":"2019-01-01"},{"$f":"D6+31","v":"2019-02-01"},{"$f":"E6+31","v":"2019-03-04"},{"$f":"F6+31","v":"2019-04-04"},{"$f":"G6+31","v":"2019-05-05"},"2019-06-05","2019-07-06","2019-08-06","2019-09-06","2019-10-07","2019-11-07","2019-12-08",{"$f":"IF('0. Basic Info'!D17=1,'0. Basic Info'!D16,\"Year 1\")","v":2019},{"$f":"DATE('0. Basic Info'!$D$16+1,'0. Basic Info'!$D$17,1)","v":"2020-01-01"},{"$f":"DATE('0. Basic Info'!$D$16+1,'0. Basic Info'!$D$17+1,1)","v":"2020-02-01"},{"$f":"DATE('0. Basic Info'!$D$16+1,'0. Basic Info'!$D$17+2,1)","v":"2020-03-01"},{"$f":"DATE('0. Basic Info'!$D$16+1,'0. Basic Info'!$D$17+3,1)","v":"2020-04-01"},{"$f":"DATE('0. Basic Info'!$D$16+1,'0. Basic Info'!$D$17+4,1)","v":"2020-05-01"},{"$f":"DATE('0. Basic Info'!$D$16+1,'0. Basic Info'!$D$17+5,1)","v":"2020-06-01"},{"$f":"DATE('0. Basic Info'!$D$16+1,'0. Basic Info'!$D$17+6,1)","v":"2020-07-01"},{"$f":"DATE('0. Basic Info'!$D$16+1,'0. Basic Info'!$D$17+7,1)","v":"2020-08-01"},{"$f":"DATE('0. Basic Info'!$D$16+1,'0. Basic Info'!$D$17+8,1)","v":"2020-09-01"},{"$f":"DATE('0. Basic Info'!$D$16+1,'0. Basic Info'!$D$17+9,1)","v":"2020-10-01"},{"$f":"DATE('0. Basic Info'!$D$16+1,'0. Basic Info'!$D$17+10,1)","v":"2020-11-01"},{"$f":"DATE('0. Basic Info'!$D$16+1,'0. Basic Info'!$D$17+11,1)","v":"2020-12-01"},{"$f":"IF('0. Basic Info'!$D17=1,'0. Basic Info'!$D16+1,\"Year 2\")","v":2020},{"$f":"IF('0. Basic Info'!$D17=1,'0. Basic Info'!$D16+2,\"Year 3\")","v":2021},{"$f":"IF('0. Basic Info'!$D17=1,'0. Basic Info'!$D16+3,\"Year 4\")","v":2022},{"$f":"IF('0. Basic Info'!$D17=1,'0. Basic Info'!$D16+4,\"Year 5\")","v":2023}]
{"$rows_left_out":75}
{"sheet":"9. Sales Summary Tables","index":10,"n_rows":0,"n_cols":0,"rows_kept":0,"cut":false,"hidden":false,"merged":[]}

{"sheet":"10. Financial Summary Tables","index":11,"n_rows":42,"n_cols":3,"rows_kept":42,"cut":false,"hidden":false,"merged":[]}
[]
[]
[]
[]
[]
[]
{"$rows_left_out":37}
{"sheet":"11. Balance Sheet","index":12,"n_rows":38,"n_cols":32,"rows_kept":38,"cut":false,"hidden":false,"merged":[]}
[{"$f":"'0. Basic Info'!D11","v":"My Business"},null,"Pro Forma Balance Sheet"]
[]
[]
[null,null,null,{"$f":"DAY(DATE(YEAR(D8),MONTH(D8)+1,1)-1)","v":31},28,31,30,31,30,31,31,30,31,30,31,{"$f":"DAY(DATE(YEAR(P6),MONTH(P6)+1,1)-1)","v":31},{"$f":"DAY(DATE(YEAR(Q8),MONTH(Q8)+1,1)-1)","v":31},29,31,30,31,30,31,31,30,31,30,31,31,31,31,31]
[]
[]
{"$rows_left_out":33}
{"sheet":"12. Loan Detail","index":13,"n_rows":31,"n_cols":68,"rows_kept":31,"cut":false,"hidden":false,"merged":[[1,0,1,2]]}
["Loan Ammortization"]
[{"$f":"'0. Basic Info'!D11","v":"My Business"},null,null,1,2,3,4,5,6,7,8,9,10,11,12,null,13,14,15,16,17,18,19,20,21,22,23,24,null,25,26,27,28,29,30,31,32,33,34,35,36,null,37,38,39,40,41,42,43,44,45,46,47,48,null,49,50,51,52,53,54,55,56,57,58,59,60]
[{"$f":"'7. Funding Plan'!A22","v":"Term Loan 1"},null,null,{"$f":"DATE('0. Basic Info'!D16,'0. Basic Info'!D17,1)","v":"2019-01-01"},{"$f":"D3+31","v":"2019-02-01"},{"$f":"E3+31","v":"2019-03-04"},{"$f":"F3+31","v":"2019-04-04"},{"$f":"G3+31","v":"2019-05-05"},"2019-06-05","2019-07-06","2019-08-06","2019-09-06","2019-10-07","2019-11-07","2019-12-08",{"$f":"IF('0. Basic Info'!$D17=1,'0. Basic Info'!$D16,\"Year 1\")","v":2019},{"$f":"D3","v":"2019-01-01"},{"$f":"Q3+31","v":"2019-02-01"},{"$f":"R3+31","v":"2019-03-04"},{"$f":"S3+31","v":"2019-04-04"},{"$f":"T3+31","v":"2019-05-05"},"2019-06-05","2019-07-06","2019-08-06","2019-09-06","2019-10-07","2019-11-07","2019-12-08",{"$f":"IF('0. Basic Info'!$D17=1,'0. Basic Info'!$D16+1,\"Year 2\")","v":2020},{"$f":"Q3","v":"2019-01-01"},{"$f":"AD3+31","v":"2019-02-01"},{"$f":"AE3+31","v":"2019-03-04"},{"$f":"AF3+31","v":"2019-04-04"},{"$f":"AG3+31","v":"2019-05-05"},"2019-06-05","2019-07-06","2019-08-06","2019-09-06","2019-10-07","2019-11-07","2019-12-08",{"$f":"IF('0. Basic Info'!$D17=1,'0. Basic Info'!$D16+2,\"Year 3\")","v":2021},{"$f":"AD3","v":"2019-01-01"},{"$f":"AQ3+31","v":"2019-02-01"},{"$f":"AR3+31","v":"2019-03-04"},{"$f":"AS3+31","v":"2019-04-04"},{"$f":"AT3+31","v":"2019-05-05"},"2019-06-05","2019-07-06","2019-08-06","2019-09-06","2019-10-07","2019-11-07","2019-12-08",{"$f":"IF('0. Basic Info'!$D17=1,'0. Basic Info'!$D16+3,\"Year 4\")","v":2022},{"$f":"AQ3","v":"2019-01-01"},{"$f":"BD3+31","v":"2019-02-01"},{"$f":"BE3+31","v":"2019-03-04"},{"$f":"BF3+31","v":"2019-04-04"},{"$f":"BG3+31","v":"2019-05-05"},"2019-06-05","2019-07-06","2019-08-06","2019-09-06","2019-10-07","2019-11-07","2019-12-08",{"$f":"IF('0. Basic Info'!$D17=1,'0. Basic Info'!$D16+4,\"Year 5\")","v":2023}]
[{"$f":"'7. Funding Plan'!C22","v":20000},"Amount","Balance",{"$f":"A4","v":20000},{"$f":"D8","v":19495.353275803136},{"$f":"E8","v":18987.973048516873},18477.844511666142,17964.952778574137,17449.282881927884,16930.819773341464,16409.548322916868,15885.453318802472,15358.519466749123,14828.731389663819,14296.073627160969,{"$f":"D4","v":20000},{"$f":"O8","v":13760.530635111229},{"$f":"Q8","v":13222.086785187885},{"$f":"R8","v":12680.72636441079},12136.433574687819,11589.192532353849,11038.987267707236,10485.801724543788,9929.6197596882048,9370.4251425229868,8808.2015545147915,8242.9325887382183,7674.6017493970212,{"$f":"Q4","v":13760.530635111229},{"$f":"IF(AB8<0.1,0,AB8)","v":7103.1924513427257},{"$f":"AD8","v":6528.688019590636},{"$f":"AE8","v":5951.0716888332227},5370.3266029508732,4786.4358145199949,4199.3822843184489,3609.1488808283116,3015.7183797359357,2419.0734634293094,1819.1967204926891,1216.0706451984954,609.6776369964582,{"$f":"AO4","v":609.6776369964582},{"$f":"IF(AO8<0.1,0,AO8)","v":0},{"$f":"AQ8","v":0},{"$f":"AR8","v":0},0,0,0,0,0,0,0,0,0,{"$f":"BB4","v":0},{"$f":"IF(BB8<0.1,0,BB8)","v":0},{"$f":"BD8","v":0},{"$f":"BE8","v":0},0,0,0,0,0,0,0,0,0,{"$f":"BO4","v":0}]
[{"$f":"'7. Funding Plan'!D22","v":6.5000000000000002E-2},"Interest","Payment",{"$f":"IF(D4>0,PMT($A5/12,$A6*12,$A4)*-1,0)","v":612.98005753019572},{"$f":"IF(E4>0,PMT($A5/12,$A6*12,$A4)*-1,0)","v":612.98005753019572},612.98005753019572,612.98005753019572,612.98005753019572,612.98005753019572,612.98005753019572,612.98005753019572,612.98005753019572,612.98005753019572,612.98005753019572,612.98005753019572,{"$f":"SUM(D5:O5)","v":7355.76069036235},612.98005753019572,612.98005753019572,612.98005753019572,612.98005753019572,612.98005753019572,612.98005753019572,612.98005753019572,612.98005753019572,612.98005753019572,612.98005753019572,612.98005753019572,612.98005753019572,{"$f":"SUM(Q5:AB5)","v":7355.76069036235},612.98005753019572,612.98005753019572,612.98005753019572,612.98005753019572,612.98005753019572,612.98005753019572,612.98005753019572,612.98005753019572,612.98005753019572,612.98005753019572,612.98005753019572,612.98005753019572,{"$f":"SUM(AD5:AO5)","v":7355.76069036235},0,0,0,0,0,0,0,0,0,0,0,0,{"$f":"SUM(AQ5:BB5)","v":0},0,0,0,0,0,0,0,0,0,0,0,0,{"$f":"SUM(BD5:BO5)","v":0}]
[{"$f":"'7. Funding Plan'!E22","v":3},"Term","Interest",{"$f":"$A5/12*D4","v":108.33333333333334},{"$f":"$A5/12*E4","v":105.59983024393365},{"$f":"$A5/12*F4","v":102.8515206794664},100.08832443819161,97.310160883943254,94.516948943776043,91.708607105599597,88.885053415799703,86.046205476846723,83.191980444891087,80.322295027345689,77.43706548045526,{"$f":"SUM(D6:O6)","v":1116.2913254735822},{"$f":"$A5/12*Q4","v":74.536207606852486},71.619636753101048,68.687267807225112,65.739015196225694,62.774792883583352,59.794514366747535,56.798092674612185,53.785440364977781,50.756469521999513,47.711091753621787,44.649218188998681,41.57075947590053,{"$f":"SUM(Q6:AB6)","v":698.4225065938457},{"$f":"$A5/12*AD4","v":38.475625778106433},35.363726772782613,32.234971647846621,29.089269099317232,25.926527328649975,22.746654040058267,19.549556437820023,16.335141223569654,13.103314593575426,9.8539822360020661,6.5870493281585167,3.3024205337308152,{"$f":"SUM(AD6:AO6)","v":252.56823901961761},{"$f":"$A5/12*AQ4","v":0},0,0,0,0,0,0,0,0,0,0,0,{"$f":"SUM(AQ6:BB6)","v":0},{"$f":"$A5/12*BD4","v":0},0,0,0,0,0,0,0,0,0,0,0,{"$f":"SUM(BD6:BO6)","v":0}]
{"$rows_left_out":26}
{"sheet":"BP Checklist","index":14,"n_rows":3,"n_cols":8,"rows_kept":3,"cut":false,"hidden":true,"merged":[]}
["Section","num","Description","question","answer 1","answer 2","answer 3","action"]
[2,1,"Name of Business","checked if available"]
[null,2,"Type"]